BDBM123783 1-{2-[(1-hydroxy-2-methylpropan-2- yl)amino]acetyl}pyrrolidine-2,5-dicarbonitrile (23)
SMILES CC(C)(CO)NCC(=O)N1C(CCC1C#N)C#N
InChI Key InChIKey=GDYIRHKDJLPJTB-UHFFFAOYSA-N
Data  1 IC50
  Tab Delimited (TSV)   2D SDfile   Computed 3D by Vconf -m prep SDfile
Find this compound or compounds like it in BindingDB:
Activity Spreadsheet -- Enzyme Inhibition Constant Data from BindingDB
Found 1 hit for monomerid = 123783
TargetDipeptidyl peptidase 4(Homo sapiens (Human))
China Pharmaceutical University
LigandPNGBDBM123783(1-{2-[(1-hydroxy-2-methylpropan-2- yl)amino]acetyl...)
Affinity DataIC50:  1.11E+3nM. Assay description: The HypoGen module in DS2.5 was employed to produce pharmaphores with the training set compounds.
In DepthDetails ArticlePubMed